brianmcgee/herdr-vm-worktree build #1 failed #2 →
/nix/store/vibv53ils95z317b0kaqb6lqxbc2ziiw-iets-classic-2.34.8/bin/nix-eval-jobs failed with exit code 1: warning: setting 'accept-flake-config' is ignored: iets never applies a flake's nixConfig, so a flake that sets extra-substituters or allow-import-from-derivation there runs without them; put the settings in nix.conf error: path '/var/lib/nixbot/worktrees/116787-bb76aa9cc6c8-85' is not a flake (because it doesn't contain a 'flake.nix' file) error: worker error: error: path '/var/lib/nixbot/worktrees/116787-bb76aa9cc6c8-85' is not a flake (because it doesn't contain a 'flake.nix' file)
eval warnings
3 kinds
· 3 occurrences
- error path '/var/lib/nixbot/worktrees/116787-bb76aa9cc6c8-85' is not a flake (because it doesn't contain a 'flake.nix' file) ×1
- error worker error: error: path '/var/lib/nixbot/worktrees/116787-bb76aa9cc6c8-85' is not a flake (because it doesn't contain a 'flake.nix' file) ×1
- warn setting 'accept-flake-config' is ignored: iets never applies a flake's nixConfig, so a flake that sets extra-substituters or allow-import-from-derivation there runs without them; put the settings in nix.conf ×1
no attributes (yet)
Effects None
all runs of this project →
effecttrigger
when
Needs attention
evaluation
event
nix failed with exit code 1: error: … while evaluating attribute 'build_finished' at «string»:88:11: 87| (map (n: walk [ n …
nix failed with exit code 1:
error:
… while evaluating attribute 'build_finished'
at «string»:88:11:
87| (map (n: walk [ n ] root.${n}) (builtins.attrNames root)))
88| ; build_finished =
| ^
89| let
… while calling the 'listToAttrs' builtin
at «string»:110:12:
109| else [];
110| in builtins.listToAttrs (builtins.concatLists
| ^
111| (map (n: walk [ n ] root.${n}) (builtins.attrNames root)))
(stack trace truncated; use '--show-trace' to show the full, detailed trace)
error: path '«git+file:///var/lib/nixbot/worktrees/event-listing-116787-86?ref=HEAD&rev=bb76aa9cc6c822df2923b462a5bf4f401cf1c339»/flake.nix' does not exist